Hi all, While running pynfs test suite with 4.1, we observed that few tests failed:- 1> SEQ6 st_sequence.testRequestTooBig : FAILURE OP_LOOKUP should return NFS4ERR_REQ_TOO_BIG, instead got NFS4ERR_NAMETOOLONG 2> CSESS21 st_create_session.testCallbackVersion : FAILURE No CB_NULL sent 3> CSESS20 st_create_session.testCallbackProgram : FAILURE No CB_NULL sent 4> EID50 st_exchange_id.testSSV : FAILURE AttributeError: 'ClientStateProtection' object has no attribute 'context' Are these failures expected i.e. we know about them and its not actually a problem OR are these issues that need to be fixed? Pls. let us know your inputs on same. Thanks and regards, Trishali.